{"text_format":"1","workbook":"xlsx","n_sheets":16,"sheets":["Introduction","Contents","Document Management","Risk Matrix","Hazard Table","Hazard List","H-01","H-02","H-03","H-04","Glossary","Potential Causes","Controls","Hazard summary Mindmap","Reference","Removed Hazard Causes Controls"],"not_rendered":{"charts":0,"images":0,"macros":1,"external_links":0,"defined_names":19,"comments":5,"pivot_tables":0},"unopened":[],"bounds":{"document_bytes":16777216,"sheet_cells":100000,"rows_first":2000,"rows_last":500,"rows_between":2000,"halvings":0,"cell_chars":16384,"cell_head_chars":4096},"cells_cut":0,"cells_raw":0,"read":"whole","date_system":"1900"}

{"sheet":"Introduction","index":0,"n_rows":15,"n_cols":10,"rows_kept":15,"cut":false,"hidden":false,"merged":[[5,2,5,4],[5,5,5,6],[8,1,8,6],[10,1,10,6],[0,9,0,10],[1,1,1,6],[2,1,2,6],[3,1,3,6],[4,2,4,4],[4,5,4,6],[0,1,0,6]]}
[null,"Introduction",null,null,null,null,null,null,null,"Contents"]
[null,"\nThe Hazard Log is a core part of the*** Name of CSC*** Clinical Safety Case File. Clinical Safety Case reviews consider intended use and reasonably foreseeable misuse. These reviews, alongside the Hazard Log culminate in a Clinical Safety Case Report, delivered at a point in time, to the ***Commissioning Body ***. This Report can then be used as a tool for the ongoing mitigation and management of any risks of the Digital Solution. As such the Hazard Log represents areas of joint and individual responsibility."]
[null,"Hazard Log Scope \n\nThe process of generating search specifications and codesets by the Primary Care Informatics (PCI) team to support vaccination and non-vaccination programmes is in scope. \nThese processes by Albasoft are in scope: \n- Use of search specifications and codesets from PCI to generate patient cohorts eligible for health programmes. \n- Delivery of this data to Public Health Scotland (PHS)  \n \nThe focus is on data obtained from general practice records (GP IT systems)."]
[]
[null,"Product ","Description ",null,null,"Manufacturer "]
[null,"**Product Name** ","**Product Description**",null,null,"**Manufacturer Details **"]
[]
[null,"Hazard Log Guidance "]
[null,"The completed Hazard Log should be reviewed together with the respective Clinical Safety Case Report to fully appreciate the service components, intended use, reasonably foreseeable misuse and clinical safety scope. The ultimate aim of the Hazard Assessment is to remove any unacceptable patient safety risks, and to implement risk Controls to reduce the residual risk to as low as reasonably practicable (ALARP). \n\nThis Hazard Log includes a number of potential Causes and Controls against each identified Hazard. It is continually updated following the assessment of live service incidents, new and enhanced functionality, as well as End-User feedback. \n\nThe Residual Risk Rating of each Hazard within this Hazard Log is only valid if the Controls are implemented and maintained through regular review and monitoring. "]
[null,"How To Read The Hazard Log "]
{"$rows_left_out":6}
{"sheet":"Contents","index":1,"n_rows":21,"n_cols":3,"rows_kept":21,"cut":false,"hidden":false,"merged":[]}
[]
[]
["Contents"]
[]
["Introduction"]
["Document Management"]
["Risk Matrix"]
["Hazard Summary"]
["Hazard List"]
["Potential Causes"]
{"$rows_left_out":12}
{"sheet":"Document Management","index":2,"n_rows":40,"n_cols":11,"rows_kept":40,"cut":false,"hidden":false,"merged":[[7,2,7,4],[22,0,22,1],[34,1,34,2],[36,1,36,2],[0,10,1,11],[30,0,30,1],[27,0,27,1],[3,2,3,4],[4,2,4,4],[5,2,5,4],[6,2,6,4],[13,0,13,1],[18,0,18,1],[23,0,23,1],[28,0,28,1],[29,0,29,1],[19,0,19,1],[20,0,20,1],[21,0,21,1],[14,0,14,1],[15,0,15,1],[16,0,16,1],[17,0,17,1],[37,1,37,2],[38,1,38,2],[39,1,39,2],[33,1,33,2],[35,1,35,2]]}
["Document Management",null,null,null,null,null,null,null,null,null,"Contents"]
[]
["Revision History"]
["Version","Date","Summary of changes"]
[]
[]
[]
[]
[]
[]
{"$rows_left_out":31}
{"sheet":"Risk Matrix","index":3,"n_rows":37,"n_cols":12,"rows_kept":37,"cut":false,"hidden":false,"merged":[[36,2,36,6],[31,2,31,3],[32,2,32,3],[33,2,33,3],[34,2,34,3],[31,4,31,6],[32,4,32,6],[33,4,33,6],[34,4,34,6],[35,2,35,6],[26,3,26,7],[27,9,27,10],[28,9,28,10],[30,9,30,10],[16,9,19,9],[18,3,18,7],[19,3,19,7],[20,9,23,9],[25,3,25,7],[23,3,23,7],[24,3,24,7],[30,2,30,3],[29,2,29,3],[29,4,29,6],[30,4,30,6],[0,10,1,11],[4,1,8,1],[4,9,5,9],[4,10,5,10],[4,11,5,11],[6,9,8,9],[7,10,8,10],[7,11,8,11],[9,9,15,9],[10,3,10,7],[10,10,13,10],[10,11,13,11],[22,3,22,7],[14,3,14,7],[15,3,15,7],[16,3,16,7],[17,3,17,7]]}
["Risk Matrix",null,null,null,null,null,null,null,null,null,"Contents"]
[]
[]
[null,null,null,null,"Risk Score Calculation Lookup",null,null,null,null,null,"Severity Category"]
[null,"Likelihood","Very High",3,4,4,5,5,null,"Severity Classification","Interpretation","Number of Patients Affected"]
[null,null,"High",2,3,3,4,5]
[null,null,"Medium",2,2,3,3,4,null,"Catastrophic","Death","Multiple"]
[null,null,"Low",1,2,2,3,4,null,null,"Permanent life-changing incapacity and any condition for which the prognosis is death or permanent life-changing incapacity; severe injury or severe incapacity from which recovery is not expected in the short term","Multiple"]
[null,null,"Very Low",1,1,2,2,3]
[null,null,null,"Minor","Significant","Considerable","Major","Catastrophic",null,"Major ","Death","Single"]
{"$rows_left_out":28}
{"sheet":"Hazard Table","index":4,"n_rows":46,"n_cols":14,"rows_kept":46,"cut":false,"hidden":false,"merged":[[40,7,41,7],[42,3,43,3],[25,6,26,6],[25,7,26,7],[42,7,43,7],[42,6,43,6],[36,4,37,4],[36,5,37,5],[36,6,37,6],[36,7,37,7],[38,7,39,7],[45,3,45,7],[34,1,43,1],[34,3,35,3],[34,4,35,4],[34,5,35,5],[34,6,35,6],[34,7,35,7],[36,2,37,2],[36,3,37,3],[40,3,41,3],[40,4,41,4],[40,5,41,5],[40,6,41,6],[42,2,43,2],[42,4,43,4],[42,5,43,5],[38,2,39,2],[38,3,39,3],[38,4,39,4],[38,5,39,5],[38,6,39,6],[23,7,24,7],[23,2,24,2],[23,4,24,4],[23,3,24,3],[23,5,24,5],[23,6,24,6],[34,2,35,2],[30,3,30,7],[27,2,28,2],[27,3,28,3],[27,4,28,4],[27,5,28,5],[27,6,28,6],[27,7,28,7],[19,7,20,7],[21,2,22,2],[8,17,9,17],[8,18,9,18],[8,19,9,19],[11,15,11,19],[19,6,20,6],[8,14,9,14],[8,15,9,15],[8,16,9,16],[21,7,22,7],[21,6,22,6],[21,5,22,5],[21,4,22,4],[21,3,22,3],[19,1,28,1],[19,2,20,2],[19,3,20,3],[19,4,20,4],[19,5,20,5],[25,3,26,3],[25,4,26,4],[25,5,26,5],[3,16,4,16],[3,17,4,17],[3,18,4,18],[3,19,4,19],[4,1,4,4],[3,15,4,15],[5,1,5,4],[5,14,6,14],[6,1,6,4],[0,13,1,14],[2,1,2,4],[3,1,3,4],[3,13,9,13],[3,14,4,14]]}
["Hazard Tables",null,null,null,null,null,null,null,null,null,null,null,null,"Contents"]
[]
["Hazard","Hazard Name",null,null,null,"Initial consequence","Initial likelihood","Initial risk score","Residual consequence","Residual likelihood","Residual risk score","Initial vs Residual Score Change"]
["H-01",{"$f":"'Hazard List'!B2","v":"Malicious misuse. "},null,null,null,{"$f":"'H-01'!B12","v":"Major"},{"$f":"'H-01'!C12","v":"Low"},{"$f":"'H-01'!D12","v":3},{"$f":"'H-01'!F12","v":"Major"},{"$f":"'H-01'!G12","v":"Low"},{"$f":"'H-01'!H12","v":3},"No change"]
["H-02",{"$f":"'Hazard List'!B3","v":"Reasonably foreseeable misuse."},null,null,null,{"$f":"'H-02'!B12","v":"Major"},{"$f":"'H-02'!C12","v":"Low"},{"$f":"'H-02'!D12","v":3},{"$f":"'H-02'!F12","v":"Major"},{"$f":"'H-02'!G12","v":"Low"},{"$f":"'H-02'!H12","v":3},"No change"]
["H-03",{"$f":"'Hazard List'!B4","v":"**Hazard 03 Name **"},null,null,null,{"$f":"'H-03'!B12","v":"Major"},{"$f":"'H-03'!C12","v":"Low"},{"$f":"'H-03'!D12","v":3},{"$f":"'H-03'!F12","v":"Major"},{"$f":"'H-03'!G12","v":"Low"},{"$f":"'H-03'!H12","v":3},"No change"]
["H-04",{"$f":"'Hazard List'!B5","v":"**Hazard 04 Name **"},null,null,null,{"$f":"'H-04'!B12","v":"Major"},{"$f":"'H-04'!C12","v":"Medium"},{"$f":"'H-04'!D12","v":3},{"$f":"'H-04'!F12","v":"Major"},{"$f":"'H-04'!G12","v":"Medium"},{"$f":"'H-04'!H12","v":3},"No change"]
[]
[]
[1,null,null,null,null,null,null,{"$f":"COUNTIF(H4:H7,\"1\")","v":0},null,null,{"$f":"COUNTIF(K4:K7,\"1\")","v":0}]
{"$rows_left_out":37}
{"sheet":"Hazard List","index":5,"n_rows":5,"n_cols":5,"rows_kept":5,"cut":false,"hidden":false,"merged":[]}
["No","Hazard name","Category","Sub-category","Priority (HML)"]
["H-01","Malicious misuse. ","IG and Security"]
["H-02","Reasonably foreseeable misuse.","Guidance and Training"]
["H-03","**Hazard 03 Name **","Technical"]
["H-04","**Hazard 04 Name **","Data & Quality"]

{"sheet":"H-01","index":6,"n_rows":22,"n_cols":11,"rows_kept":22,"cut":false,"hidden":false,"merged":[[9,14,9,15],[12,1,12,3],[12,5,12,6],[22,0,22,7],[17,5,17,6],[0,0,0,1],[0,2,0,7],[4,0,4,1],[4,2,4,7],[5,0,5,1],[5,2,5,7],[6,0,6,1],[6,2,6,7],[7,4,7,5],[9,0,9,7],[13,2,13,7],[14,0,14,1],[14,2,14,7],[7,0,7,1],[0,8,1,9],[1,0,1,1],[1,2,1,7],[3,0,3,1],[3,2,3,7],[13,0,13,1],[19,1,19,3],[15,12,15,13],[15,1,15,7],[16,0,16,7],[17,1,17,3],[19,5,19,6],[18,1,18,3],[18,5,18,6]]}
["Hazard ID ",null,"H-01",null,null,null,null,null,"Contents"]
["Hazard Name:",null,{"$f":"IF(ISBLANK(C1),\"\",VLOOKUP(C1,'Hazard List'!A2:B47,2))","v":"Malicious misuse. "}]
[]
["Hazard Summary",null,"Details"]
["CATEGORY",null,{"$f":"'Hazard List'!C4","v":"Technical"}]
["SUB CATEGORY"]
["HAZARD DESCRIPTION",null,"Intentional attempts to misuse, disrupt or alter the function of digital solution in a way not intended by the manufacturer."]
["Date:",null,"29/02/2024",null,"Latest modification Date:",null,"2024-03-04"]
[]
["Clinical Risk Assessment"]
{"$rows_left_out":13}
{"sheet":"H-02","index":7,"n_rows":22,"n_cols":11,"rows_kept":22,"cut":false,"hidden":false,"merged":[[22,0,22,7],[4,0,4,1],[4,2,4,7],[5,0,5,1],[5,2,5,7],[6,0,6,1],[6,2,6,7],[18,5,18,6],[19,5,19,6],[19,1,19,3],[0,0,0,1],[0,2,0,7],[0,8,1,9],[1,0,1,1],[1,2,1,7],[15,12,15,13],[15,1,15,7],[18,1,18,3],[3,0,3,1],[3,2,3,7],[16,0,16,7],[17,1,17,3],[17,5,17,6],[7,0,7,1],[7,4,7,5],[9,0,9,7],[13,0,13,1],[13,2,13,7],[14,0,14,1],[14,2,14,7]]}
["Hazard ID ",null,"H-02",null,null,null,null,null,"Contents"]
["Hazard Name:",null,{"$f":"IF(ISBLANK(C1),\"\",VLOOKUP(C1,'Hazard List'!A2:B47,2))","v":"Reasonably foreseeable misuse."}]
[]
["Hazard Summary",null,"Details"]
["CATEGORY",null,{"$f":"'Hazard List'!C5","v":"Data & Quality"}]
["SUB CATEGORY"]
["HAZARD DESCRIPTION",null,"Unintentional misuse, disruption or alteration to the function of the digital soution  in a way not intended by the manufacturer."]
["Date:",null,"29/02/2024",null,"Latest modification Date:",null,"2024-03-04"]
[]
["Clinical Risk Assessment"]
{"$rows_left_out":13}
{"sheet":"H-03","index":8,"n_rows":28,"n_cols":11,"rows_kept":28,"cut":false,"hidden":false,"merged":[[5,0,5,1],[5,2,5,7],[6,0,6,1],[6,2,6,7],[4,0,4,1],[4,2,4,7],[0,8,1,9],[1,0,1,1],[1,2,1,7],[3,0,3,1],[3,2,3,7],[0,0,0,1],[0,2,0,7],[14,0,14,1],[20,0,22,0],[21,5,21,6],[22,5,22,6],[20,5,20,6],[20,1,22,3],[14,2,14,7],[7,0,7,1],[7,4,7,5],[9,0,9,7],[13,0,13,1],[13,2,13,7],[28,0,28,7],[15,12,15,13],[17,1,17,3],[17,5,17,6],[18,5,18,6],[16,0,16,7],[18,1,19,3],[19,5,19,6],[24,5,24,6],[18,0,19,0],[23,1,25,3],[23,5,23,6],[25,5,25,6],[15,1,15,7]]}
["Hazard ID ",null,"H-03",null,null,null,null,null,"Contents"]
["Hazard Name:",null,{"$f":"IF(ISBLANK(C1),\"\",VLOOKUP(C1,'Hazard List'!A2:B47,2))","v":"**Hazard 03 Name **"}]
[]
["Hazard Summary",null,"Details"]
["CATEGORY",null,{"$f":"'Hazard List'!C2","v":"IG and Security"}]
["SUB CATEGORY"]
["HAZARD DESCRIPTION",null,"** Hazard Description**"]
["Date:",null,"29/02/2024",null,"Latest modification Date:",null,"2024-03-04"]
[]
["Clinical Risk Assessment"]
{"$rows_left_out":19}
{"sheet":"H-04","index":9,"n_rows":29,"n_cols":11,"rows_kept":29,"cut":false,"hidden":false,"merged":[[29,0,29,7],[20,1,20,3],[21,1,21,3],[16,0,16,7],[17,1,17,3],[17,5,17,6],[18,5,18,6],[19,5,19,6],[20,5,20,6],[0,8,1,9],[1,0,1,1],[1,2,1,7],[3,0,3,1],[3,2,3,7],[0,0,0,1],[0,2,0,7],[4,0,4,1],[4,2,4,7],[5,0,5,1],[5,2,5,7],[6,0,6,1],[6,2,6,7],[7,0,7,1],[7,4,7,5],[9,0,9,7],[22,5,22,6],[24,5,24,6],[18,1,19,3],[18,0,19,0],[23,5,23,6],[13,0,13,1],[13,2,13,7],[14,0,14,1],[23,1,24,3],[23,0,24,0],[22,1,22,3],[21,5,21,6],[14,2,14,7]]}
["Hazard ID ",null,"H-04",null,null,null,null,null,"Contents"]
["Hazard Name:",null,{"$f":"IF(ISBLANK(C1),\"\",VLOOKUP(C1,'Hazard List'!A2:B47,2))","v":"**Hazard 04 Name **"}]
[]
["Hazard Summary",null,"Details"]
["CATEGORY",null,{"$f":"'Hazard List'!C3","v":"Guidance and Training"}]
["SUB CATEGORY"]
["HAZARD DESCRIPTION",null,"**Hazard Description**"]
["Date:",null,"29/02/2024",null,"Latest modification Date:",null,"2024-03-04"]
[]
["Clinical Risk Assessment"]
{"$rows_left_out":20}
{"sheet":"Glossary","index":10,"n_rows":66,"n_cols":12,"rows_kept":66,"cut":false,"hidden":false,"merged":[[0,11,1,12]]}
["Appt ","Appointment ",null,null,null,null,null,null,null,null,null,"Contents"]
["ALARP ","As Low As Reasonably Practicable "]
["AWS ","Amazon Web Services "]
["BAU ","Business As Usual "]
["BC&DR ","Business Continuity and Disaster Recovery "]
["CHI ","Community Health Index "]
["CMO ","Chief Medical Officer "]
["COVID ","Coronavirus Disease "]
["CRMP ","Clinical Risk Management Plan "]
["CSC ","Clinical Safety Case "]
{"$rows_left_out":57}
{"sheet":"Potential Causes","index":11,"n_rows":11,"n_cols":5,"rows_kept":11,"cut":false,"hidden":false,"merged":[]}
["Cause ID","Cause Description","Cause Categories","Causes with Post-Marketing Surveillance (PMS) features","Removed Causes Comments"]
["CA-001","Incorrect cohort data production.","Data & Quality","PMS"]
["CA-002","New patient not registered correctly","Technical"]
["CA-003","Patients opting out of sharing their records with healthcare providers.","Governance"]
["CA-004","Incomplete user documentation","Governance"]
["CA-005","Inadequate test scripts","Testing"]
["CA-006","Data extract incomplete","Data & Quality","PMS"]
["CA-007","Invalid data items","Data & Quality","PMS"]
["CA-008","clinical coding speficication incorrect","Data & Quality","PMS"]
["CA-009","No audit trail available for interactions","Technical","PMS"]
{"$rows_left_out":2}
{"sheet":"Controls","index":12,"n_rows":18,"n_cols":10,"rows_kept":18,"cut":false,"hidden":false,"merged":[]}
["Control ID","Control Description","Control Type","Control Strength","Control Categories","Controls with Post-Marketing Surveillance (PMS) features","Potential Owner for Implementation","Controls with Partial Evidence","Removed Controls Comments","Notes"]
["CO-001","Trained staff available to respond to queries","Existing","Weak","Operational Processes","PMS","Not Applicable","Yes"]
["CO-002","Information leaflets and signposting provided to patient","Existing","Weak","Operational Processes",null,"Not Applicable"]
["CO-003","Quality checks in place.","Existing","Medium","Data & Quality","PMS","Not Applicable","Yes"]
["CO-004","Multiple clinicians reviewing the specifications","Existing","Medium","Resources",null,"Not Applicable","Yes"]
["CO-005","Clearly defined codesets","Potential","Medium","Policy",null,"Elsewhere"]
["CO-006","Adverse Events and near misses logged and reported","Potential","Medium","Governance","PMS","Operations"]
["CO-007","Checks on number of expected records vs number of records actually received.","Potential","Weak","Data & Quality","PMS","Supplier"]
["CO-008","Supplier carries out some base checking and removes these patients from the cohort.","Potential","Weak","Data & Quality",null,"Elsewhere"]
["CO-009","Validation checks added to BMI fields","Potential","Weak","Data & Quality",null,"Elsewhere"]
{"$rows_left_out":9}
{"sheet":"Hazard summary Mindmap","index":13,"n_rows":1,"n_cols":24,"rows_kept":1,"cut":false,"hidden":false,"merged":[[0,23,1,24]]}
["Overview of Hazards identified - MINDMAP",null,null,null,null,null,null,null,null,null,null,null,null,null,null,null,null,null,null,null,null,null,null,"Contents"]

{"sheet":"Reference","index":14,"n_rows":21,"n_cols":10,"rows_kept":21,"cut":false,"hidden":false,"merged":[[0,9,1,10]]}
["Control type",null,"Hazard Categories",null,"Cause Categories",null,"Control Categories",null,"Potential Control Owner / Implementor","Contents"]
["Existing",null,"Governance",null,"Communication",null,"Communication",null,"Supplier"]
["Additional",null,"Guidance and Training",null,"Contractual",null,"BC/DR",null,"Elsewhere"]
["Potential",null,"IG and Security",null,"Cybersecurity",null,"Contractual",null,"Operations"]
[null,null,"Mapping",null,"Data & Quality",null,"Cybersecurity",null,"Not Applicable"]
["Control Strength",null,"Resources",null,"Environmental",null,"Data & Quality",null,"Product Owner"]
["Strong",null,"Technical",null,"Functionality",null,"Environmental",null,"Governance Group"]
["Medium",null,"Data & Quality",null,"Governance",null,"Functionality"]
["Weak",null,null,null,"Guidance and Training",null,"Governance"]
[null,null,null,null,"Human Factors",null,"Guidance and Training"]
{"$rows_left_out":12}
{"sheet":"Removed Hazard Causes Controls","index":15,"n_rows":38,"n_cols":6,"rows_kept":38,"cut":false,"hidden":false,"merged":[[0,5,1,6]]}
["Hazard ID","Hazard Description","Notes",null,null,"Contents"]
[]
[]
[]
[]
[]
[]
[]
[]
[]
{"$rows_left_out":28}